BDBM50310809 3-(1-(4-chlorophenylcarbamoyl)-3-(2-(trifluoromethyl)phenyl)piperidin-3-yl)propanoic acid::CHEMBL1079257
SMILES OC(=O)CCC1(CCCN(C1)C(=O)Nc1ccc(Cl)cc1)c1ccccc1C(F)(F)F
InChI Key InChIKey=WAFKWVRPHCVAGK-UHFFFAOYSA-N
Data  7 IC50
  Tab Delimited (TSV)   2D SDfile   Computed 3D by Vconf -m prep SDfile
Find this compound or compounds like it in BindingDB:
Activity Spreadsheet -- Enzyme Inhibition Constant Data from BindingDB
Found 7 hits for monomerid = 50310809
TargetBifunctional epoxide hydrolase 2(Homo sapiens (Human))
Merck Research Laboratories
Curated by ChEMBL
LigandPNGBDBM50310809(3-(1-(4-chlorophenylcarbamoyl)-3-(2-(trifluorometh...)
Affinity DataIC50:  16nM. Assay description: Inhibition of human soluble epoxide hydrolase
In DepthDetails ArticlePubMed
TargetBifunctional epoxide hydrolase 2(Rattus norvegicus)
Merck Research Laboratories
Curated by ChEMBL
LigandPNGBDBM50310809(3-(1-(4-chlorophenylcarbamoyl)-3-(2-(trifluorometh...)
Affinity DataIC50:  70nM. Assay description: Inhibition of rat soluble epoxide hydrolase
In DepthDetails ArticlePubMed
TargetEpoxide hydrolase 1(Homo sapiens (Human))
Merck Research Laboratories
Curated by ChEMBL
LigandPNGBDBM50310809(3-(1-(4-chlorophenylcarbamoyl)-3-(2-(trifluorometh...)
Affinity DataIC50: >1.00E+5nM. Assay description: Inhibition of human microsomal epoxide hydrolase
In DepthDetails ArticlePubMed
TargetSodium channel protein type 5 subunit alpha(Homo sapiens (Human))
Merck Research Laboratories
Curated by ChEMBL
LigandPNGBDBM50310809(3-(1-(4-chlorophenylcarbamoyl)-3-(2-(trifluorometh...)
Affinity DataIC50: >1.00E+4nM. Assay description: Inhibition of Nav1.5 channel
In DepthDetails ArticlePubMed
TargetCytochrome P450 2D6(Homo sapiens (Human))
Merck Research Laboratories
Curated by ChEMBL
LigandPNGBDBM50310809(3-(1-(4-chlorophenylcarbamoyl)-3-(2-(trifluorometh...)
Affinity DataIC50: >1.00E+4nM. Assay description: Inhibition of CYP2D6
In DepthDetails ArticlePubMed
TargetCytochrome P450 3A4(Homo sapiens (Human))
Merck Research Laboratories
Curated by ChEMBL
LigandPNGBDBM50310809(3-(1-(4-chlorophenylcarbamoyl)-3-(2-(trifluorometh...)
Affinity DataIC50: >1.00E+4nM. Assay description: Inhibition of CYP3A4
In DepthDetails ArticlePubMed
TargetCytochrome P450 2C9(Homo sapiens (Human))
Merck Research Laboratories
Curated by ChEMBL
LigandPNGBDBM50310809(3-(1-(4-chlorophenylcarbamoyl)-3-(2-(trifluorometh...)
Affinity DataIC50: >1.00E+4nM. Assay description: Inhibition of CYP2C9
In DepthDetails ArticlePubMed