BDBM50310819 2-(1-(4-chlorophenylcarbamoyl)-3-phenylpiperidin-3-yl)acetic acid::CHEMBL1077781
SMILES OC(=O)CC1(CCCN(C1)C(=O)Nc1ccc(Cl)cc1)c1ccccc1
InChI Key InChIKey=SCQHVECWBAHHHV-UHFFFAOYSA-N
Data  8 IC50
  Tab Delimited (TSV)   2D SDfile   Computed 3D by Vconf -m prep SDfile
Find this compound or compounds like it in BindingDB:
Activity Spreadsheet -- Enzyme Inhibition Constant Data from BindingDB
Found 8 hits for monomerid = 50310819
TargetBifunctional epoxide hydrolase 2(Homo sapiens (Human))
Merck Research Laboratories
Curated by ChEMBL
LigandPNGBDBM50310819(2-(1-(4-chlorophenylcarbamoyl)-3-phenylpiperidin-3...)
Affinity DataIC50:  52nM. Assay description: Inhibition of human soluble epoxide hydrolase
In DepthDetails ArticlePubMed
TargetBifunctional epoxide hydrolase 2(Rattus norvegicus)
Merck Research Laboratories
Curated by ChEMBL
LigandPNGBDBM50310819(2-(1-(4-chlorophenylcarbamoyl)-3-phenylpiperidin-3...)
Affinity DataIC50:  398nM. Assay description: Inhibition of rat soluble epoxide hydrolase
In DepthDetails ArticlePubMed
TargetBifunctional epoxide hydrolase 2(Homo sapiens (Human))
Merck Research Laboratories
Curated by ChEMBL
LigandPNGBDBM50310819(2-(1-(4-chlorophenylcarbamoyl)-3-phenylpiperidin-3...)
Affinity DataIC50:  3.80E+4nM. Assay description: Inhibition of human soluble epoxide hydrolase in HEK293 cells assessed as DHET production
In DepthDetails ArticlePubMed
TargetSodium channel protein type 5 subunit alpha(Homo sapiens (Human))
Merck Research Laboratories
Curated by ChEMBL
LigandPNGBDBM50310819(2-(1-(4-chlorophenylcarbamoyl)-3-phenylpiperidin-3...)
Affinity DataIC50: >1.00E+4nM. Assay description: Inhibition of Nav1.5 channel
In DepthDetails ArticlePubMed
TargetCytochrome P450 2C9(Homo sapiens (Human))
Merck Research Laboratories
Curated by ChEMBL
LigandPNGBDBM50310819(2-(1-(4-chlorophenylcarbamoyl)-3-phenylpiperidin-3...)
Affinity DataIC50: >1.00E+4nM. Assay description: Inhibition of CYP2C9
In DepthDetails ArticlePubMed
TargetCytochrome P450 2D6(Homo sapiens (Human))
Merck Research Laboratories
Curated by ChEMBL
LigandPNGBDBM50310819(2-(1-(4-chlorophenylcarbamoyl)-3-phenylpiperidin-3...)
Affinity DataIC50: >1.00E+4nM. Assay description: Inhibition of CYP2D6
In DepthDetails ArticlePubMed
TargetCytochrome P450 3A4(Homo sapiens (Human))
Merck Research Laboratories
Curated by ChEMBL
LigandPNGBDBM50310819(2-(1-(4-chlorophenylcarbamoyl)-3-phenylpiperidin-3...)
Affinity DataIC50: >1.00E+4nM. Assay description: Inhibition of CYP3A4
In DepthDetails ArticlePubMed
TargetEpoxide hydrolase 1(Homo sapiens (Human))
Merck Research Laboratories
Curated by ChEMBL
LigandPNGBDBM50310819(2-(1-(4-chlorophenylcarbamoyl)-3-phenylpiperidin-3...)
Affinity DataIC50: >1.00E+5nM. Assay description: Inhibition of human microsomal epoxide hydrolase
In DepthDetails ArticlePubMed