BDBM50310907 (2-(methyl(pyridin-3-ylmethyl)amino)thieno[3,2-d]pyrimidin-4-yl)(5-methylthiophen-2-yl)methanone::CHEMBL1078087
SMILES CN(Cc1cccnc1)c1nc(C(=O)c2ccc(C)s2)c2sccc2n1
InChI Key InChIKey=VVLORNBXNONRLN-UHFFFAOYSA-N
Data  2 IC50
  Tab Delimited (TSV)   2D SDfile   Computed 3D by Vconf -m prep SDfile
Find this compound or compounds like it in BindingDB:
Activity Spreadsheet -- Enzyme Inhibition Constant Data from BindingDB
Found 2 hits for monomerid = 50310907
TargetAdenosine receptor A2a(Homo sapiens (Human))
Vernalis (R&D)
Curated by ChEMBL
LigandPNGBDBM50310907((2-(methyl(pyridin-3-ylmethyl)amino)thieno[3,2-d]p...)
Affinity DataIC50:  2.27E+3nM. Assay description: Antagonist activity at human adeosine A2A receptor expressed in CHOK1 cells assessed as inhibition of calcium mobilization by FLIPR assay
In DepthDetails ArticlePubMed
TargetAdenosine receptor A2b(Homo sapiens (Human))
Vernalis (R&D)
Curated by ChEMBL
LigandPNGBDBM50310907((2-(methyl(pyridin-3-ylmethyl)amino)thieno[3,2-d]p...)
Affinity DataIC50:  4.14E+3nM. Assay description: Antagonist activity at human adeosine A2B receptor expressed in CHOK1 cells assessed as inhibition of calcium mobilization by FLIPR assay
In DepthDetails ArticlePubMed