BDBM50310926 2-[(Pyridin-3-ylmethyl)-amino]-thieno[3,2-d]pyrimidine-4-carboxylic acid methyl-amide::CHEMBL1081334
SMILES CNC(=O)c1nc(NCc2cccnc2)nc2ccsc12
InChI Key InChIKey=QBVQGHRDPUQNOB-UHFFFAOYSA-N
Data  2 IC50
  Tab Delimited (TSV)   2D SDfile   Computed 3D by Vconf -m prep SDfile
Find this compound or compounds like it in BindingDB:
Activity Spreadsheet -- Enzyme Inhibition Constant Data from BindingDB
Found 2 hits for monomerid = 50310926
TargetAdenosine receptor A2a(Homo sapiens (Human))
Vernalis (R&D)
Curated by ChEMBL
LigandPNGBDBM50310926(2-[(Pyridin-3-ylmethyl)-amino]-thieno[3,2-d]pyrimi...)
Affinity DataIC50:  7.11E+3nM. Assay description: Antagonist activity at human adeosine A2A receptor expressed in CHOK1 cells assessed as inhibition of calcium mobilization by FLIPR assay
In DepthDetails ArticlePubMed
TargetAdenosine receptor A2b(Homo sapiens (Human))
Vernalis (R&D)
Curated by ChEMBL
LigandPNGBDBM50310926(2-[(Pyridin-3-ylmethyl)-amino]-thieno[3,2-d]pyrimi...)
Affinity DataIC50:  495nM. Assay description: Antagonist activity at human adeosine A2B receptor expressed in CHOK1 cells assessed as inhibition of calcium mobilization by FLIPR assay
In DepthDetails ArticlePubMed