BDBM50311458 CHEMBL4163628
SMILES CC(=O)n1cc(C(=O)Nc2cc(cc(c2)-c2cc3ccccc3o2)C(O)=O)c2ccccc12
InChI Key InChIKey=UPPVALURUONBPV-UHFFFAOYSA-N
Data  1 IC50
  Tab Delimited (TSV)   2D SDfile   Computed 3D by Vconf -m prep SDfile
Find this compound or compounds like it in BindingDB:
Activity Spreadsheet -- Enzyme Inhibition Constant Data from BindingDB
Found 1 hit for monomerid = 50311458
TargetCREB-binding protein(Homo sapiens (Human))
Guangzhou Medical University
Curated by ChEMBL
LigandPNGBDBM50311458(CHEMBL4163628)
Affinity DataIC50:  2.81E+3nM. Assay description: Inhibition of biotinylated-H4KAc4 binding to human His6-tagged CBP (R1081 to G1197 residues) expressed in Escherichia coli BL21(DE3) after 2.5 hrs by...
In DepthDetails ArticlePubMed