BDBM50311577 CHEMBL561967::Erybreadin B::erybraedin B
SMILES [#6]\[#6](-[#6])=[#6]\[#6]-c1c(-[#8])ccc2-[#6@@H]-3-[#8]-c4c(ccc5-[#8]C([#6])([#6])[#6]=[#6]-c45)-[#6@@H]-3-[#6]-[#8]-c12
InChI Key InChIKey=XDRMVDDOBVPELW-CYFREDJKSA-N
Data  1 IC50
  Tab Delimited (TSV)   2D SDfile   Computed 3D by Vconf -m prep SDfile
Find this compound or compounds like it in BindingDB:
Activity Spreadsheet -- Enzyme Inhibition Constant Data from BindingDB
Found 1 hit for monomerid = 50311577
TargetTyrosine-protein phosphatase non-receptor type 1(Homo sapiens (Human))
Chosun University
Curated by ChEMBL
LigandPNGBDBM50311577(CHEMBL561967 | Erybreadin B | erybraedin B)
Affinity DataIC50:  4.20E+3nM. Assay description: Inhibition of human recombinant PTP1B assessed as p-nitrophenol production
In DepthDetails ArticlePubMed