BDBM50311781 (R,S)-3-(1H-imidazol-4-yl)propyl 5-methylhexan-2-ylcarbamate::CHEMBL1081720
SMILES CC(C)CCC(C)NC(=O)OCCCc1cnc[nH]1
InChI Key InChIKey=AIPXZCQJTXUFHL-UHFFFAOYSA-N
Data  1 KI
  Tab Delimited (TSV)   2D SDfile   Computed 3D by Vconf -m prep SDfile
Find this compound or compounds like it in BindingDB:
Activity Spreadsheet -- Enzyme Inhibition Constant Data from BindingDB
Found 1 hit for monomerid = 50311781
TargetHistamine H3 receptor(Homo sapiens (Human))
Jagiellonian University Medical College
Curated by ChEMBL
LigandPNGBDBM50311781((R,S)-3-(1H-imidazol-4-yl)propyl 5-methylhexan-2-y...)
Affinity DataKi:  30nM. Assay description: Displacement of [3H]iodoproxyfan from human histamine H3 receptor expressed in CHO-K1 cells
In DepthDetails ArticlePubMed