BDBM50311789 4'-butoxy-3'-((2-fluoro-4-(trifluoromethyl)benzamido)methyl)-4-methylbiphenyl-3-carboxylic acid::CHEMBL1081355
SMILES CCCCOc1ccc(cc1CNC(=O)c1ccc(cc1F)C(F)(F)F)-c1ccc(C)c(c1)C(O)=O
InChI Key InChIKey=VHHPOJGXZXTKKK-UHFFFAOYSA-N
Data  2 EC50
  Tab Delimited (TSV)   2D SDfile   Computed 3D by Vconf -m prep SDfile
Find this compound or compounds like it in BindingDB:
Activity Spreadsheet -- Enzyme Inhibition Constant Data from BindingDB
Found 2 hits for monomerid = 50311789
TargetPeroxisome proliferator-activated receptor delta(Homo sapiens (Human))
The University Of Tokyo
Curated by ChEMBL
LigandPNGBDBM50311789(4'-butoxy-3'-((2-fluoro-4-(trifluoromethyl)benzami...)
Affinity DataEC50:  14nM. Assay description: Agonist activity at PPARdelta receptor expressed in HEK293 cells cotransfected with GAL4 by transactivation assay
In DepthDetails ArticlePubMed
TargetPeroxisome proliferator-activated receptor alpha(Homo sapiens (Human))
The University Of Tokyo
Curated by ChEMBL
LigandPNGBDBM50311789(4'-butoxy-3'-((2-fluoro-4-(trifluoromethyl)benzami...)
Affinity DataEC50:  120nM. Assay description: Agonist activity at PPARalpha receptor expressed in HEK293 cells cotransfected with GAL4 by transactivation assay
In DepthDetails ArticlePubMed