BDBM50311938 CHEMBL1076476::N-(4-methyl-3-(1-(6-morpholinopyrimidin-4-yl)-1H-benzo[d]imidazol-2-ylamino)phenyl)-3-(trifluoromethyl)benzamide
SMILES Cc1ccc(NC(=O)c2cccc(c2)C(F)(F)F)cc1Nc1nc2ccccc2n1-c1cc(ncn1)N1CCOCC1
InChI Key InChIKey=GGEALBVZDVXUND-UHFFFAOYSA-N
Data  8 IC50
  Tab Delimited (TSV)   2D SDfile   Computed 3D by Vconf -m prep SDfile
Find this compound or compounds like it in BindingDB:
Activity Spreadsheet -- Enzyme Inhibition Constant Data from BindingDB
Found 8 hits for monomerid = 50311938
TargetTyrosine-protein kinase Lck(Homo sapiens (Human))
Genomics Institute Of The Novartis Research Foundation
Curated by ChEMBL
LigandPNGBDBM50311938(CHEMBL1076476 | N-(4-methyl-3-(1-(6-morpholinopyri...)
Affinity DataIC50: >2.50E+3nM. Assay description: Inhibition of LCK
In DepthDetails ArticlePubMed
TargetProto-oncogene tyrosine-protein kinase Src(Homo sapiens (Human))
Genomics Institute Of The Novartis Research Foundation
Curated by ChEMBL
LigandPNGBDBM50311938(CHEMBL1076476 | N-(4-methyl-3-(1-(6-morpholinopyri...)
Affinity DataIC50: >1.00E+4nM. Assay description: Inhibition of Tel-fused SRC expressed in mouse BAF3 cells
In DepthDetails ArticlePubMed
TargetInsulin receptor(Homo sapiens (Human))
Genomics Institute Of The Novartis Research Foundation
Curated by ChEMBL
LigandPNGBDBM50311938(CHEMBL1076476 | N-(4-methyl-3-(1-(6-morpholinopyri...)
Affinity DataIC50: >1.00E+4nM. Assay description: Inhibition of Tel-fused InsR expressed in mouse BAF3 cells
In DepthDetails ArticlePubMed
TargetTyrosine-protein kinase HCK(Homo sapiens (Human))
Genomics Institute Of The Novartis Research Foundation
Curated by ChEMBL
LigandPNGBDBM50311938(CHEMBL1076476 | N-(4-methyl-3-(1-(6-morpholinopyri...)
Affinity DataIC50: >2.50E+3nM. Assay description: Inhibition of HCK
In DepthDetails ArticlePubMed
TargetTyrosine-protein kinase Lck(Homo sapiens (Human))
Genomics Institute Of The Novartis Research Foundation
Curated by ChEMBL
LigandPNGBDBM50311938(CHEMBL1076476 | N-(4-methyl-3-(1-(6-morpholinopyri...)
Affinity DataIC50: >1.00E+4nM. Assay description: Inhibition of Tel-fused LCK expressed in mouse BAF3 cells
In DepthDetails ArticlePubMed
TargetTyrosine-protein kinase Lyn(Homo sapiens (Human))
Genomics Institute Of The Novartis Research Foundation
Curated by ChEMBL
LigandPNGBDBM50311938(CHEMBL1076476 | N-(4-methyl-3-(1-(6-morpholinopyri...)
Affinity DataIC50: >1.00E+4nM. Assay description: Inhibition of Tel-fused LYN expressed in mouse BAF3 cells
In DepthDetails ArticlePubMed
TargetVascular endothelial growth factor receptor 2(Homo sapiens (Human))
Genomics Institute Of The Novartis Research Foundation
Curated by ChEMBL
LigandPNGBDBM50311938(CHEMBL1076476 | N-(4-methyl-3-(1-(6-morpholinopyri...)
Affinity DataIC50: >1.00E+4nM. Assay description: Inhibition of Tel-fused KDR expressed in mouse BAF3 cells
In DepthDetails ArticlePubMed
TargetProto-oncogene tyrosine-protein kinase Src(Homo sapiens (Human))
Genomics Institute Of The Novartis Research Foundation
Curated by ChEMBL
LigandPNGBDBM50311938(CHEMBL1076476 | N-(4-methyl-3-(1-(6-morpholinopyri...)
Affinity DataIC50: >2.50E+3nM. Assay description: Inhibition of SRC
In DepthDetails ArticlePubMed