BDBM50311987 1-((1S,4S)-5-(4-(3-(4-fluoro-3-hydroxyphenyl)-2-(pyridin-4-yl)pyrazolo[1,5-a]pyrimidin-7-yl)phenyl)-2,5-diazabicyclo[2.2.1]heptan-2-yl)ethanone::CHEMBL1076206
SMILES CC(=O)N1C[C@@H]2C[C@H]1CN2c1ccc(cc1)-c1ccnc2c(c(nn12)-c1ccncc1)-c1ccc(F)c(O)c1
InChI Key InChIKey=JEJHYHQYTOXLOT-ZEQRLZLVSA-N
Data  1 IC50
  Tab Delimited (TSV)   2D SDfile   Computed 3D by Vconf -m prep SDfile
Find this compound or compounds like it in BindingDB:
Activity Spreadsheet -- Enzyme Inhibition Constant Data from BindingDB
Found 1 hit for monomerid = 50311987
TargetSerine/threonine-protein kinase B-raf(Homo sapiens (Human))
Wyeth Research
Curated by ChEMBL
LigandPNGBDBM50311987(1-((1S,4S)-5-(4-(3-(4-fluoro-3-hydroxyphenyl)-2-(p...)
Affinity DataIC50:  0.5nM. Assay description: Inhibition of human recombinant B-Raf expressed in Sf9 cells assessed as inhibition of Mek1 phosphorylation
In DepthDetails ArticlePubMed