BDBM50312313 (+/-)-trans-N-(1-benzoyl-2-methyl-1,2,3,4-tetrahydroquinolin-4-yl)-N-phenylacetamide::CHEMBL1080626
SMILES C[C@H]1C[C@H](N(C(C)=O)c2ccccc2)c2ccccc2N1C(=O)c1ccccc1
InChI Key InChIKey=JTPBHSOTKJMPKR-UUOWRZLLSA-N
Data  1 IC50
  Tab Delimited (TSV)   2D SDfile   Computed 3D by Vconf -m prep SDfile
Find this compound or compounds like it in BindingDB:
Activity Spreadsheet -- Enzyme Inhibition Constant Data from BindingDB
Found 1 hit for monomerid = 50312313
TargetProstaglandin D2 receptor 2(Homo sapiens (Human))
Amgen
Curated by ChEMBL
LigandPNGBDBM50312313((+/-)-trans-N-(1-benzoyl-2-methyl-1,2,3,4-tetrahyd...)
Affinity DataIC50: >1.00E+4nM. Assay description: Displacement of [3H]PGD2 from human CRTH2 receptor expressed in 293 cells by scintillation counting in presence of 0.5% BSA
In DepthDetails ArticlePubMed