BDBM50312461 2-(4-(3-(4,5-Bis(4-methoxyphenyl)thiazol-2-ylthio)propoxy)-3-chlorophenyl)acetic Acid::CHEMBL1079962
SMILES COc1ccc(cc1)-c1nc(SCCCOc2ccc(OCC(O)=O)cc2Cl)sc1-c1ccc(OC)cc1
InChI Key InChIKey=ZAHDVQMSSOLLAS-UHFFFAOYSA-N
Data  3 EC50
  Tab Delimited (TSV)   2D SDfile   Computed 3D by Vconf -m prep SDfile
Find this compound or compounds like it in BindingDB:
Activity Spreadsheet -- Enzyme Inhibition Constant Data from BindingDB
Found 3 hits for monomerid = 50312461
TargetPeroxisome proliferator-activated receptor gamma(Homo sapiens (Human))
The Genomics Institute Of The Novartis Research Foundation
Curated by ChEMBL
LigandPNGBDBM50312461(2-(4-(3-(4,5-Bis(4-methoxyphenyl)thiazol-2-ylthio)...)
Affinity DataEC50:  4.61E+3nM. Assay description: Agonist activity at human PPARgamma ligand binding domain expressed in human 293T cells cotransfected with Gal4-DBD by luciferase transactivation ass...
In DepthDetails ArticlePubMed
TargetPeroxisome proliferator-activated receptor alpha(Homo sapiens (Human))
The Genomics Institute Of The Novartis Research Foundation
Curated by ChEMBL
LigandPNGBDBM50312461(2-(4-(3-(4,5-Bis(4-methoxyphenyl)thiazol-2-ylthio)...)
Affinity DataEC50:  840nM. Assay description: Agonist activity at human PPARalpha ligand binding domain expressed in human 293T cells cotransfected with Gal4-DBD by luciferase transactivation ass...
In DepthDetails ArticlePubMed
TargetPeroxisome proliferator-activated receptor delta(Homo sapiens (Human))
The Genomics Institute Of The Novartis Research Foundation
Curated by ChEMBL
LigandPNGBDBM50312461(2-(4-(3-(4,5-Bis(4-methoxyphenyl)thiazol-2-ylthio)...)
Affinity DataEC50: >1.00E+4nM. Assay description: Agonist activity at human PPARdelta ligand binding domain expressed in human 293T cells cotransfected with Gal4-DBD by luciferase transactivation ass...
In DepthDetails ArticlePubMed