BDBM50312476 CHEMBL1080699::{4-[4-(6-Isopropoxypyridin-3-yl)-5-(4-trifluoromethoxyphenyl)-oxazol-2-ylmethoxy]-2-methylphenoxy}acetic Acid
SMILES CC(C)Oc1ccc(cn1)-c1nc(COc2ccc(OCC(O)=O)c(C)c2)oc1-c1ccc(OC(F)(F)F)cc1
InChI Key InChIKey=DNHZIQUHIDDATB-UHFFFAOYSA-N
Data  5 EC50
  Tab Delimited (TSV)   2D SDfile   Computed 3D by Vconf -m prep SDfile
Find this compound or compounds like it in BindingDB:
Activity Spreadsheet -- Enzyme Inhibition Constant Data from BindingDB
Found 5 hits for monomerid = 50312476
TargetPeroxisome proliferator-activated receptor gamma(Homo sapiens (Human))
The Genomics Institute Of The Novartis Research Foundation
Curated by ChEMBL
LigandPNGBDBM50312476(CHEMBL1080699 | {4-[4-(6-Isopropoxypyridin-3-yl)-5...)
Affinity DataEC50:  7.00E+4nM. Assay description: Agonist activity at human PPARgamma ligand binding domain expressed in human 293T cells cotransfected with Gal4-DBD by luciferase transactivation ass...
In DepthDetails ArticlePubMed
TargetPeroxisome proliferator-activated receptor alpha(Homo sapiens (Human))
The Genomics Institute Of The Novartis Research Foundation
Curated by ChEMBL
LigandPNGBDBM50312476(CHEMBL1080699 | {4-[4-(6-Isopropoxypyridin-3-yl)-5...)
Affinity DataEC50:  790nM. Assay description: Agonist activity at human PPARalpha ligand binding domain expressed in human 293T cells cotransfected with Gal4-DBD by luciferase transactivation ass...
In DepthDetails ArticlePubMed
TargetPeroxisome proliferator-activated receptor delta(Mus musculus)
The Genomics Institute Of The Novartis Research Foundation
Curated by ChEMBL
LigandPNGBDBM50312476(CHEMBL1080699 | {4-[4-(6-Isopropoxypyridin-3-yl)-5...)
Affinity DataEC50:  7nM. Assay description: Agonist activity at mouse PPARdelta by FRET assay
In DepthDetails ArticlePubMed
TargetPeroxisome proliferator-activated receptor delta(Homo sapiens (Human))
The Genomics Institute Of The Novartis Research Foundation
Curated by ChEMBL
LigandPNGBDBM50312476(CHEMBL1080699 | {4-[4-(6-Isopropoxypyridin-3-yl)-5...)
Affinity DataEC50:  14nM. Assay description: Agonist activity at human PPARdelta ligand binding domain by FRET assay
In DepthDetails ArticlePubMed
TargetPeroxisome proliferator-activated receptor delta(Homo sapiens (Human))
The Genomics Institute Of The Novartis Research Foundation
Curated by ChEMBL
LigandPNGBDBM50312476(CHEMBL1080699 | {4-[4-(6-Isopropoxypyridin-3-yl)-5...)
Affinity DataEC50:  2.49E+3nM. Assay description: Agonist activity at human PPARdelta ligand binding domain expressed in human 293T cells cotransfected with Gal4-DBD by luciferase transactivation ass...
In DepthDetails ArticlePubMed