BDBM50312513 CHEMBL1085913::[10-(4-Dimethylamino-benzyl)-3,4-dioxo-3,4-dihydro-10H-benzo[4,5]imidazo[2,1-c][1,2,4]triazin-2-yl]-acetic acid
SMILES CN(C)c1ccc(Cn2c3ccccc3n3c2nn(CC(O)=O)c(=O)c3=O)cc1
InChI Key InChIKey=IESARKBXKZMSEB-UHFFFAOYSA-N
Data  1 IC50
  Tab Delimited (TSV)   2D SDfile   Computed 3D by Vconf -m prep SDfile
Find this compound or compounds like it in BindingDB:
Activity Spreadsheet -- Enzyme Inhibition Constant Data from BindingDB
Found 1 hit for monomerid = 50312513
TargetAldo-keto reductase family 1 member B1(Rattus norvegicus)
Institute Of Pharmaceutical Sciences
Curated by ChEMBL
LigandPNGBDBM50312513(CHEMBL1085913 | [10-(4-Dimethylamino-benzyl)-3,4-d...)
Affinity DataIC50:  3.84E+4nM. Assay description: Inhibition of Albino rat eye lens ALR2 assessed as NADPH oxidation by spectrophotometry
In DepthDetails ArticlePubMed