BDBM50312514 CHEMBL1093737::[10-(4-Bromo-benzyl)-3,4-dioxo-3,4-dihydro-10H-benzo[4,5]imidazo[2,1-c][1,2,4]triazin-2-yl]-acetic acid
SMILES OC(=O)Cn1nc2n(Cc3ccc(Br)cc3)c3ccccc3n2c(=O)c1=O
InChI Key InChIKey=GKXKWBCARCSQKS-UHFFFAOYSA-N
Data  1 IC50
  Tab Delimited (TSV)   2D SDfile   Computed 3D by Vconf -m prep SDfile
Find this compound or compounds like it in BindingDB:
Activity Spreadsheet -- Enzyme Inhibition Constant Data from BindingDB
Found 1 hit for monomerid = 50312514
TargetAldo-keto reductase family 1 member B1(Rattus norvegicus)
Institute Of Pharmaceutical Sciences
Curated by ChEMBL
LigandPNGBDBM50312514(CHEMBL1093737 | [10-(4-Bromo-benzyl)-3,4-dioxo-3,4...)
Affinity DataIC50:  4.76E+3nM. Assay description: Inhibition of Albino rat eye lens ALR2 assessed as NADPH oxidation by spectrophotometry
In DepthDetails ArticlePubMed