BDBM50312532 CHEMBL1077010::molassamide
SMILES CCCC(=O)N[C@@H](C)C(=O)N[C@@H]([C@@H](C)O)C(=O)N[C@H]1[C@@H](C)OC(=O)[C@@H](NC(=O)[C@H](Cc2ccc(O)cc2)N(C)C(=O)[C@H](Cc2ccccc2)N2[C@H](O)CC[C@H](NC(=O)\C(NC1=O)=C\C)C2=O)C(C)C
InChI Key InChIKey=KXSGCAPYMUMVSH-VFYPFKDGSA-N
Data  2 IC50
  Tab Delimited (TSV)   2D SDfile   Computed 3D by Vconf -m prep SDfile
Find this compound or compounds like it in BindingDB:
Activity Spreadsheet -- Enzyme Inhibition Constant Data from BindingDB
Found 2 hits for monomerid = 50312532
TargetChymotrypsinogen A(Bos taurus (bovine))
Smithsonian Marine Station At Ft. Pierce
Curated by ChEMBL
LigandPNGBDBM50312532(CHEMBL1077010 | molassamide)
Affinity DataIC50:  234nM. Assay description: Inhibition of bovine pancreas alpha-chymotrypsin preincubated for 10 mins by spectrophotometry
In DepthDetails ArticlePubMed
TargetChymotrypsin-like elastase family member 1(Sus scrofa (Pig))
Smithsonian Marine Station At Ft. Pierce
Curated by ChEMBL
LigandPNGBDBM50312532(CHEMBL1077010 | molassamide)
Affinity DataIC50:  32nM. Assay description: Inhibition of pig pancreatic elastase preincubated for 15 mins by spectrophotometry
In DepthDetails ArticlePubMed