BDBM50312837 CHEMBL1081610::[11C]8-butoxy-N-cyclohexyl-7-methoxy-2-oxo-1,2-dihydroquinoline-3-carboxamide
SMILES CCCCOc1c(OC)ccc2cc(C(=O)NC3CCCCC3)c(=O)[nH]c12
InChI Key InChIKey=KIVHVAVIXCVGPY-UHFFFAOYSA-N
Data  5 KI
  Tab Delimited (TSV)   2D SDfile   Computed 3D by Vconf -m prep SDfile
Find this compound or compounds like it in BindingDB:
Activity Spreadsheet -- Enzyme Inhibition Constant Data from BindingDB
Found 5 hits for monomerid = 50312837
TargetCannabinoid receptor 2(Homo sapiens (Human))
National Institute Of Radiological Sciences
Curated by ChEMBL
LigandPNGBDBM50312837(CHEMBL1081610 | [11C]8-butoxy-N-cyclohexyl-7-metho...)
Affinity DataKi:  9.60nM. Assay description: Binding affinity to human CB2 receptor
In DepthDetails ArticlePubMed
TargetCannabinoid receptor 2(Homo sapiens (Human))
National Institute Of Radiological Sciences
Curated by ChEMBL
LigandPNGBDBM50312837(CHEMBL1081610 | [11C]8-butoxy-N-cyclohexyl-7-metho...)
Affinity DataKi:  9.60nM. Assay description: Binding affinity to human cannabinoid CB2 receptor
In DepthDetails ArticlePubMed
TargetCannabinoid receptor 2(Homo sapiens (Human))
National Institute Of Radiological Sciences
Curated by ChEMBL
LigandPNGBDBM50312837(CHEMBL1081610 | [11C]8-butoxy-N-cyclohexyl-7-metho...)
Affinity DataKi:  9.60nM. Assay description: Binding affinity to human CB2R assessed as inhibition constant
In DepthDetails PubMed
TargetCannabinoid receptor 2(Homo sapiens (Human))
National Institute Of Radiological Sciences
Curated by ChEMBL
LigandPNGBDBM50312837(CHEMBL1081610 | [11C]8-butoxy-N-cyclohexyl-7-metho...)
Affinity DataKi:  9.60nM. Assay description: Inhibition of human CB2 receptor assessed as inhibition constant
In DepthDetails PubMed
TargetCannabinoid receptor 1(Homo sapiens (Human))
Institut F£R Pharmazeutische Und Medizinische Chemie Der Universit£T M£Nster
Curated by ChEMBL
LigandPNGBDBM50312837(CHEMBL1081610 | [11C]8-butoxy-N-cyclohexyl-7-metho...)
Affinity DataKi: >1.00E+3nM. Assay description: Binding affinity to human cannabinoid CB1 receptor
In DepthDetails ArticlePubMed