BDBM50313024 (Z)-3-phenyl-4-(2-phenylhydrazono)-1H-pyrazol-5(4H)-one::CHEMBL1081430
SMILES O=c1[nH][nH]c(c1N=Nc1ccccc1)-c1ccccc1
InChI Key InChIKey=RQYDDTYSQPQGIO-UHFFFAOYSA-N
Data  1 KI
  Tab Delimited (TSV)   2D SDfile   Computed 3D by Vconf -m prep SDfile
Find this compound or compounds like it in BindingDB:
Activity Spreadsheet -- Enzyme Inhibition Constant Data from BindingDB
Found 1 hit for monomerid = 50313024
TargetGlycogen synthase kinase-3 beta(Homo sapiens (Human))
Vertex Pharmaceuticals
Curated by ChEMBL
LigandPNGBDBM50313024((Z)-3-phenyl-4-(2-phenylhydrazono)-1H-pyrazol-5(4H...)
Affinity DataKi:  99nM. Assay description: Inhibition of GSK3-beta assessed as NADH level after 10 mins by pyruvate kinase/lactate dehydrogenase coupled spectrophotometric assay
In DepthDetails ArticlePubMed