BDBM50313032 (Z)-4-(2-(4-methoxyphenyl)hydrazono)-3-(pyridin-4-yl)-1H-pyrazol-5(4H)-one::CHEMBL1081631
SMILES COc1ccc(cc1)N=Nc1c([nH][nH]c1=O)-c1ccncc1
InChI Key InChIKey=CMJRGKYDMVQFTL-UHFFFAOYSA-N
Data  1 KI
  Tab Delimited (TSV)   2D SDfile   Computed 3D by Vconf -m prep SDfile
Find this compound or compounds like it in BindingDB:
Activity Spreadsheet -- Enzyme Inhibition Constant Data from BindingDB
Found 1 hit for monomerid = 50313032
TargetGlycogen synthase kinase-3 beta(Homo sapiens (Human))
Vertex Pharmaceuticals
Curated by ChEMBL
LigandPNGBDBM50313032((Z)-4-(2-(4-methoxyphenyl)hydrazono)-3-(pyridin-4-...)
Affinity DataKi:  30nM. Assay description: Inhibition of GSK3-beta assessed as NADH level after 10 mins by pyruvate kinase/lactate dehydrogenase coupled spectrophotometric assay
In DepthDetails ArticlePubMed