BDBM50313056 (Z)-4-(2-(3-chlorophenyl)hydrazono)-3-(3,4-dimethoxyphenyl)-1H-pyrazol-5(4H)-one::CHEMBL1088011
SMILES COc1ccc(cc1OC)-c1[nH][nH]c(=O)c1N=Nc1cccc(Cl)c1
InChI Key InChIKey=ULLNNJONKBEIPP-UHFFFAOYSA-N
Data  1 KI
  Tab Delimited (TSV)   2D SDfile   Computed 3D by Vconf -m prep SDfile
Find this compound or compounds like it in BindingDB:
Activity Spreadsheet -- Enzyme Inhibition Constant Data from BindingDB
Found 1 hit for monomerid = 50313056
TargetGlycogen synthase kinase-3 beta(Homo sapiens (Human))
Vertex Pharmaceuticals
Curated by ChEMBL
LigandPNGBDBM50313056((Z)-4-(2-(3-chlorophenyl)hydrazono)-3-(3,4-dimetho...)
Affinity DataKi:  0.400nM. Assay description: Inhibition of GSK3-beta assessed as NADH level after 10 mins by pyruvate kinase/lactate dehydrogenase coupled spectrophotometric assay
In DepthDetails ArticlePubMed