BDBM50313071 7-(furan-2-yl)-6-(pyrimidin-4-yl)pyrido[2,3-d]pyrimidine-2,4(1H,3H)-dione::CHEMBL1080513
SMILES O=c1[nH]c2nc(-c3ccco3)c(cc2c(=O)[nH]1)-c1ccncn1
InChI Key InChIKey=VYTAHRSDFGGCON-UHFFFAOYSA-N
Data  4 KI
  Tab Delimited (TSV)   2D SDfile   Computed 3D by Vconf -m prep SDfile
Find this compound or compounds like it in BindingDB:
Activity Spreadsheet -- Enzyme Inhibition Constant Data from BindingDB
Found 4 hits for monomerid = 50313071
TargetAdenosine receptor A2b(Homo sapiens (Human))
RhôNe-Poulenc Rorer
Curated by ChEMBL
LigandPNGBDBM50313071(7-(furan-2-yl)-6-(pyrimidin-4-yl)pyrido[2,3-d]pyri...)
Affinity DataKi:  1nM. Assay description: Displacement of [3H]DPCPX from human adenosine A2B receptor expressed in HEK293 cells after 60 mins by filtration binding assay
In DepthDetails ArticlePubMed
TargetAdenosine receptor A2a(Homo sapiens (Human))
RhôNe-Poulenc Rorer
Curated by ChEMBL
LigandPNGBDBM50313071(7-(furan-2-yl)-6-(pyrimidin-4-yl)pyrido[2,3-d]pyri...)
Affinity DataKi:  181nM. Assay description: Displacement of [3H]ZM241385 from human adenosine A2A receptor expressed in human HeLa cells after 1 hr by scintillation proximity assay
In DepthDetails ArticlePubMed
TargetAdenosine receptor A1(Homo sapiens (Human))
RhôNe-Poulenc Rorer
Curated by ChEMBL
LigandPNGBDBM50313071(7-(furan-2-yl)-6-(pyrimidin-4-yl)pyrido[2,3-d]pyri...)
Affinity DataKi:  1.73E+3nM. Assay description: Displacement of [3H]DPCPX from human adenosine A1 receptor expressed in CHO cells after 90 mins by filtration binding assay
In DepthDetails ArticlePubMed
TargetAdenosine receptor A3(Homo sapiens (Human))
RhôNe-Poulenc Rorer
Curated by ChEMBL
LigandPNGBDBM50313071(7-(furan-2-yl)-6-(pyrimidin-4-yl)pyrido[2,3-d]pyri...)
Affinity DataKi:  6.27E+3nM. Assay description: Displacement of [3H]NECA from human adenosine A3 receptor expressed in human HeLa cells after 3 hrs by filtration binding assay
In DepthDetails ArticlePubMed