BDBM50313197 4-Hydroxy-1,1-dioxo-1,2-dihydro-1lambda*6*-benzo[e][1,2]thiazine-3-carboxylic acid(4'-chloro-biphenyl-4-yl)-amide::CHEMBL1086611
SMILES OC1=C(NS(=O)(=O)c2ccccc12)C(=O)Nc1ccc(cc1)-c1ccc(Cl)cc1
InChI Key InChIKey=JUYSXIYGRKHDAM-UHFFFAOYSA-N
Data  3 IC50
  Tab Delimited (TSV)   2D SDfile   Computed 3D by Vconf -m prep SDfile
Find this compound or compounds like it in BindingDB:
Activity Spreadsheet -- Enzyme Inhibition Constant Data from BindingDB
Found 3 hits for monomerid = 50313197
TargetProstaglandin E synthase(Homo sapiens (Human))
Pfizer
Curated by ChEMBL
LigandPNGBDBM50313197(4-Hydroxy-1,1-dioxo-1,2-dihydro-1lambda*6*-benzo[e...)
Affinity DataIC50:  290nM. Assay description: Inhibition of human mPGES1 assessed as PGE2 level after 41 sec by ELISA
In DepthDetails ArticlePubMed
TargetProstaglandin G/H synthase 2(Homo sapiens (Human))
Pfizer
Curated by ChEMBL
LigandPNGBDBM50313197(4-Hydroxy-1,1-dioxo-1,2-dihydro-1lambda*6*-benzo[e...)
Affinity DataIC50:  3.37E+4nM. Assay description: Inhibition of human COX2 in IL-1beta treated human FF cells assessed as blockade of SnCl2-mediated PGH2 to PGF2alpha conversion after 50 mins by ELIS...
In DepthDetails ArticlePubMed
TargetProstaglandin E synthase(Homo sapiens (Human))
Pfizer
Curated by ChEMBL
LigandPNGBDBM50313197(4-Hydroxy-1,1-dioxo-1,2-dihydro-1lambda*6*-benzo[e...)
Affinity DataIC50:  1.45E+3nM. Assay description: Inhibition of human mPGES1 in IL-1beta treated human FF cells assessed as blockade of PGH2 to PGE2 conversion after 50 mins by ELISA
In DepthDetails ArticlePubMed