BDBM50313243 CHEMBL1076602::[Sar1,Tdf2]AngII
SMILES CC[C@H](C)[C@H](NC(=O)[C@H](Cc1ccc(O)cc1)NC(=O)[C@@H](NC(=O)[C@H](Cc1ccc(cc1)C1(N=N1)C(F)(F)F)NC(=O)CNC)C(C)C)C(=O)N[C@@H](Cc1cnc[nH]1)C(=O)N1CCC[C@H]1C(=O)N[C@@H](Cc1ccccc1)C(O)=O
InChI Key InChIKey=IANMQZMQGQLRSI-LTTXXCTBSA-N
Data  1 KI
  Tab Delimited (TSV)   2D SDfile   Computed 3D by Vconf -m prep SDfile
Find this compound or compounds like it in BindingDB:
Activity Spreadsheet -- Enzyme Inhibition Constant Data from BindingDB
Found 1 hit for monomerid = 50313243
TargetType-1 angiotensin II receptor(Homo sapiens (Human))
Universite De Sherbrooke
Curated by ChEMBL
LigandPNGBDBM50313243(CHEMBL1076602 | [Sar1,Tdf2]AngII)
Affinity DataKi:  24.7nM. Assay description: Displacement of [125I][Sar1,Ile8]Ang2 from wild-type human AT1 receptor expressed in CHO cells by gamma counting
In DepthDetails ArticlePubMed