BDBM50313246 CHEMBL1076612::[Bpa1]AngII
SMILES CC[C@H](C)[C@H](NC(=O)[C@H](Cc1ccc(O)cc1)NC(=O)[C@@H](NC(=O)[C@H](CCCN=C(N)N)NC(=O)[C@@H](N)Cc1ccc(cc1)C(=O)c1ccccc1)C(C)C)C(=O)N[C@@H](Cc1cnc[nH]1)C(=O)N1CCC[C@H]1C(=O)N[C@@H](Cc1ccccc1)C(O)=O
InChI Key InChIKey=SSPYRQDCPZQEBX-LWJOARRHSA-N
Data  1 KI
  Tab Delimited (TSV)   2D SDfile   Computed 3D by Vconf -m prep SDfile
Find this compound or compounds like it in BindingDB:
Activity Spreadsheet -- Enzyme Inhibition Constant Data from BindingDB
Found 1 hit for monomerid = 50313246
TargetType-1 angiotensin II receptor(Homo sapiens (Human))
Universite De Sherbrooke
Curated by ChEMBL
LigandPNGBDBM50313246(CHEMBL1076612 | [Bpa1]AngII)
Affinity DataKi:  19.4nM. Assay description: Displacement of [125I][Sar1,Ile8]Ang2 from wild-type human AT1 receptor expressed in CHO cells by gamma counting
In DepthDetails ArticlePubMed