BDBM50313339 6-(cyclohexyl(propyl)amino)-N-(2-methyl-4-sulfamoylphenyl)pyrimidine-4-carboxamide::CHEMBL1088178::US9150519, 1-54
SMILES CCCN(C1CCCCC1)c1cc(ncn1)C(=O)Nc1ccc(cc1C)S(N)(=O)=O
InChI Key InChIKey=WJNRZOPOVIDXMH-UHFFFAOYSA-N
Data  3 EC50
  Tab Delimited (TSV)   2D SDfile   Computed 3D by Vconf -m prep SDfile
Find this compound or compounds like it in BindingDB:
Activity Spreadsheet -- Enzyme Inhibition Constant Data from BindingDB
Found 3 hits for monomerid = 50313339
TargetSphingosine 1-phosphate receptor 1(Homo sapiens (Human))
Merck Serono
US Patent
LigandPNGBDBM50313339(6-(cyclohexyl(propyl)amino)-N-(2-methyl-4-sulfamoy...)
Affinity DataEC50:  2.90nMpH: 7.4 T: 2°C. Assay description: Measurements of 35S-GTPgammaS Binding: Membranes (1 to 10 µg protein) prepared as described above, were incubated in 96-well Scintiplates (PerkinElm...
In DepthDetails US Patent
TargetSphingosine 1-phosphate receptor 1(Homo sapiens (Human))
Merck Serono
US Patent
LigandPNGBDBM50313339(6-(cyclohexyl(propyl)amino)-N-(2-methyl-4-sulfamoy...)
Affinity DataEC50:  2.90nM. Assay description: Agonist activity at S1P1 receptor expressed in CHO cells after 60 mins by [35S]-GTPgammaS binding assay
In DepthDetails ArticlePubMed
TargetSphingosine 1-phosphate receptor 3(Homo sapiens (Human))
Merck Serono
US Patent
LigandPNGBDBM50313339(6-(cyclohexyl(propyl)amino)-N-(2-methyl-4-sulfamoy...)
Affinity DataEC50:  1.99E+3nMpH: 7.4 T: 2°C. Assay description: Measurements of 35S-GTPgammaS Binding: Membranes (1 to 10 µg protein) prepared as described above, were incubated in 96-well Scintiplates (PerkinElm...
In DepthDetails US Patent