BDBM50313531 2-(3-isopropylphenyl)-3,5-dioxo-4-(3-(piperidin-1-yl)propyl)-2,3,4,5-tetrahydro-1,2,4-triazine-6-carbonitrile::CHEMBL1084125
SMILES CC(C)c1cccc(c1)-n1nc(C#N)c(=O)n(CCCN2CCCCC2)c1=O
InChI Key InChIKey=ZYXLJLBAZLNCHS-UHFFFAOYSA-N
Data  1 IC50
  Tab Delimited (TSV)   2D SDfile   Computed 3D by Vconf -m prep SDfile
Find this compound or compounds like it in BindingDB:
Activity Spreadsheet -- Enzyme Inhibition Constant Data from BindingDB
Found 1 hit for monomerid = 50313531
TargetCathepsin K(Homo sapiens (Human))
Schering-Plough
Curated by ChEMBL
LigandPNGBDBM50313531(2-(3-isopropylphenyl)-3,5-dioxo-4-(3-(piperidin-1-...)
Affinity DataIC50:  38nM. Assay description: Inhibition of human recombinant cathepsin K by fluorescence assay
In DepthDetails ArticlePubMed