BDBM50313570 (E)-4-(4-methyl-1H-indol-5-ylamino)-5-(2-(6-(piperazin-1-ylmethyl)pyridin-2-yl)vinyl)nicotinonitrile::CHEMBL1082225
SMILES Cc1c(Nc2c(\C=C\c3cccc(CN4CCNCC4)n3)cncc2C#N)ccc2[nH]ccc12
InChI Key InChIKey=YOHRIASJHGRMLP-AATRIKPKSA-N
Data  1 IC50
  Tab Delimited (TSV)   2D SDfile   Computed 3D by Vconf -m prep SDfile
Find this compound or compounds like it in BindingDB:
Activity Spreadsheet -- Enzyme Inhibition Constant Data from BindingDB
Found 1 hit for monomerid = 50313570
TargetProtein kinase C theta type(Homo sapiens (Human))
Wyeth Research
Curated by ChEMBL
LigandPNGBDBM50313570((E)-4-(4-methyl-1H-indol-5-ylamino)-5-(2-(6-(piper...)
Affinity DataIC50:  0.320nM. Assay description: Inhibition of PKCtheta
In DepthDetails ArticlePubMed