BDBM50313721 4'-(2-(5-benzyl-1H-imidazol-2-yl)ethyl)biphenyl-2-carboxylic acid::CHEMBL1085434
SMILES OC(=O)c1ccccc1-c1ccc(CCc2ncc(Cc3ccccc3)[nH]2)cc1
InChI Key InChIKey=ANHWCAHXALYTNY-UHFFFAOYSA-N
Data  2 EC50
  Tab Delimited (TSV)   2D SDfile   Computed 3D by Vconf -m prep SDfile
Find this compound or compounds like it in BindingDB:
Activity Spreadsheet -- Enzyme Inhibition Constant Data from BindingDB
Found 2 hits for monomerid = 50313721
TargetBombesin receptor subtype-3(Mus musculus)
Merck Research Laboratories
Curated by ChEMBL
LigandPNGBDBM50313721(4'-(2-(5-benzyl-1H-imidazol-2-yl)ethyl)biphenyl-2-...)
Affinity DataEC50:  11nM. Assay description: Agonistic activity at mouse BRS3 expressed in HEK293AEO cells by aequorin bioluminescence assay
In DepthDetails ArticlePubMed
TargetBombesin receptor subtype-3(Homo sapiens (Human))
Merck Research Laboratories
Curated by ChEMBL
LigandPNGBDBM50313721(4'-(2-(5-benzyl-1H-imidazol-2-yl)ethyl)biphenyl-2-...)
Affinity DataEC50:  205nM. Assay description: Agonistic activity at human BRS3 expressed in HEK293AEO cells by aequorin bioluminescence assay
In DepthDetails ArticlePubMed