BDBM50313734 4'-(2-(5-(4-chlorobenzyl)-1H-imidazol-2-yl)ethyl)biphenyl-2-carboxylic acid::CHEMBL1087933
SMILES OC(=O)c1ccccc1-c1ccc(CCc2ncc(Cc3ccc(Cl)cc3)[nH]2)cc1
InChI Key InChIKey=DXQXSWQHJWEHDS-UHFFFAOYSA-N
Data  2 EC50
  Tab Delimited (TSV)   2D SDfile   Computed 3D by Vconf -m prep SDfile
Find this compound or compounds like it in BindingDB:
Activity Spreadsheet -- Enzyme Inhibition Constant Data from BindingDB
Found 2 hits for monomerid = 50313734
TargetBombesin receptor subtype-3(Mus musculus)
Merck Research Laboratories
Curated by ChEMBL
LigandPNGBDBM50313734(4'-(2-(5-(4-chlorobenzyl)-1H-imidazol-2-yl)ethyl)b...)
Affinity DataEC50:  102nM. Assay description: Agonistic activity at mouse BRS3 expressed in HEK293AEO cells by aequorin bioluminescence assay
In DepthDetails ArticlePubMed
TargetBombesin receptor subtype-3(Homo sapiens (Human))
Merck Research Laboratories
Curated by ChEMBL
LigandPNGBDBM50313734(4'-(2-(5-(4-chlorobenzyl)-1H-imidazol-2-yl)ethyl)b...)
Affinity DataEC50:  2.29E+3nM. Assay description: Agonistic activity at human BRS3 expressed in HEK293AEO cells by aequorin bioluminescence assay
In DepthDetails ArticlePubMed