BDBM50313904 3-((2-amino-2-benzyl-3-methoxypropoxy)methyl)-N-((R)-1-(4-fluorophenyl)ethyl)-5-(N-methylmethylsulfonamido)benzamide::CHEMBL1090060
SMILES COCC(N)(COCc1cc(cc(c1)C(=O)N[C@H](C)c1ccc(F)cc1)N(C)S(C)(=O)=O)Cc1ccccc1
InChI Key InChIKey=WWPRRUFEAYIBJG-QYWNIODHSA-N
Data  1 IC50
  Tab Delimited (TSV)   2D SDfile   Computed 3D by Vconf -m prep SDfile
Find this compound or compounds like it in BindingDB:
Activity Spreadsheet -- Enzyme Inhibition Constant Data from BindingDB
Found 1 hit for monomerid = 50313904
TargetBeta-secretase 1(Homo sapiens (Human))
Merck Research Laboratories
Curated by ChEMBL
LigandPNGBDBM50313904(3-((2-amino-2-benzyl-3-methoxypropoxy)methyl)-N-((...)
Affinity DataIC50: >1.00E+5nM. Assay description: Inhibition of BACE1
In DepthDetails ArticlePubMed