BDBM50314107 (3R,8R,11S,17S,20S,29S,32S,38aS)-17-((1H-imidazol-4-yl)methyl)-8-((S)-2-((S)-2-acetamido-5-guanidinopentanamido)-3-phenylpropanamido)-20-benzyl-32-(4-hydroxybenzyl)-11-((R)-1-hydroxyethyl)-29-isobutyl-1,9,12,15,18,21,24,27,30,33,34-undecaoxohexatriacontahydropyrrolo[2,1-g][1,2,5,8,12,15,18,21,24,27,30,33]dithiadecaazacyclohexatriacontine-3-carboxamide::CHEMBL1089945
SMILES CC(C)C[C@@H]1NC(=O)CNC(=O)CNC(=O)[C@H](Cc2ccccc2)NC(=O)[C@H](Cc2cnc[nH]2)NC(=O)CNC(=O)[C@@H](NC(=O)[C@H](CSSC[C@H](NC(=O)[C@@H]2CCCN2C(=O)C(=O)[C@H](Cc2ccc(O)cc2)NC1=O)C(N)=O)NC(=O)[C@H](Cc1ccccc1)NC(=O)[C@H](CCCNC(N)=N)NC(C)=O)[C@@H](C)O
InChI Key InChIKey=KCRCHIPXFWUNGB-XMQMWVRNSA-N
Data  1 IC50  1 Kd
  Tab Delimited (TSV)   2D SDfile   Computed 3D by Vconf -m prep SDfile
Find this compound or compounds like it in BindingDB:
Activity Spreadsheet -- Enzyme Inhibition Constant Data from BindingDB
Found 2 hits for monomerid = 50314107
TargetIgG receptor FcRn large subunit p51(Homo sapiens (Human))
Syntonix Pharmaceuticals
Curated by ChEMBL
LigandPNGBDBM50314107((3R,8R,11S,17S,20S,29S,32S,38aS)-17-((1H-imidazol-...)
Affinity DataKd:  5.90E+3nMpH: 6.0Assay Description:Binding affinity to soluble human FcRn at pH 6 by surface plasmon resonance assay
In DepthDetails ArticlePubMed
TargetIgG receptor FcRn large subunit p51(Homo sapiens (Human))
Syntonix Pharmaceuticals
Curated by ChEMBL
LigandPNGBDBM50314107((3R,8R,11S,17S,20S,29S,32S,38aS)-17-((1H-imidazol-...)
Affinity DataIC50:  3.70E+4nM. Assay description: Inhibition of IgG binding to soluble human FcRn after 5 hrs by competition ELISA
In DepthDetails ArticlePubMed