BDBM50314136 CHEMBL1089339::N-Hydroxy-N'-(3-methylphenyl)octanediamide
SMILES Cc1cccc(NC(=O)CCCCC(=O)NO)c1
InChI Key InChIKey=QJSROQKJUVLPRM-UHFFFAOYSA-N
Data  2 IC50
  Tab Delimited (TSV)   2D SDfile   Computed 3D by Vconf -m prep SDfile
Find this compound or compounds like it in BindingDB:
Activity Spreadsheet -- Enzyme Inhibition Constant Data from BindingDB
Found 2 hits for monomerid = 50314136
TargetHistone deacetylase 3(Homo sapiens (Human))
Umr Cnrs 6026-Universit£
Curated by ChEMBL
LigandPNGBDBM50314136(CHEMBL1089339 | N-Hydroxy-N'-(3-methylphenyl)octan...)
Affinity DataIC50:  58nM. Assay description: Ex vivo inhibition of human HDAC3 in human Caco2 cells by flurometric cellular activity assay
In DepthDetails ArticlePubMed
TargetHistone deacetylase 1(Homo sapiens (Human))
Umr Cnrs 6026-Universit£
Curated by ChEMBL
LigandPNGBDBM50314136(CHEMBL1089339 | N-Hydroxy-N'-(3-methylphenyl)octan...)
Affinity DataIC50:  57nM. Assay description: Ex vivo inhibition of human HDAC1 in human Caco2 cells by flurometric cellular activity assay
In DepthDetails ArticlePubMed