BDBM50314170 1-(1-(3-(3-(3-(2-(4-methylpiperidin-1-yl)ethylthio)-4-(trifluoromethyl)phenyl)-5-(methylsulfonyl)-4,5,6,7-tetrahydro-1H-pyrazolo[4,3-c]pyridin-1-yl)propyl)piperidin-4-yl)pyrrolidin-2-one::CHEMBL1093958
SMILES CC1CCN(CCSc2cc(ccc2C(F)(F)F)-c2nn(CCCN3CCC(CC3)N3CCCC3=O)c3CCN(Cc23)S(C)(=O)=O)CC1
InChI Key InChIKey=UYBBAEBLFCGVOT-UHFFFAOYSA-N
Data  2 IC50
  Tab Delimited (TSV)   2D SDfile   Computed 3D by Vconf -m prep SDfile
Find this compound or compounds like it in BindingDB:
Activity Spreadsheet -- Enzyme Inhibition Constant Data from BindingDB
Found 2 hits for monomerid = 50314170
TargetCathepsin S(Homo sapiens (Human))
Johnson & Johnson Pharmaceutical Research & Development
Curated by ChEMBL
LigandPNGBDBM50314170(1-(1-(3-(3-(3-(2-(4-methylpiperidin-1-yl)ethylthio...)
Affinity DataIC50:  810nM. Assay description: Inhibition of cathepsin S in human JY cells assessed as inhibition of invariant chain degradation
In DepthDetails ArticlePubMed
TargetCathepsin S(Homo sapiens (Human))
Johnson & Johnson Pharmaceutical Research & Development
Curated by ChEMBL
LigandPNGBDBM50314170(1-(1-(3-(3-(3-(2-(4-methylpiperidin-1-yl)ethylthio...)
Affinity DataIC50:  110nM. Assay description: Inhibition of human cathepsin S
In DepthDetails ArticlePubMed