BDBM50314245 CHEMBL1090987::rac-2-(5-(5-ethyl-1-(2-hydroxy-3-(4-(pyridin-2-yl)piperidin-1-yl)propyl)-4,5,6,7-tetrahydro-1H-pyrazolo[4,3-c]pyridin-3-yl)-2-(trifluoromethyl)phenylthio)-1-(pyrrolidin-1-yl)ethanone
SMILES CCN1CCc2c(C1)c(nn2CC(O)CN1CCC(CC1)c1ccccn1)-c1ccc(c(SCC(=O)N2CCCC2)c1)C(F)(F)F
InChI Key InChIKey=BNQVFVPZXLTYLM-UHFFFAOYSA-N
Data  1 IC50
  Tab Delimited (TSV)   2D SDfile   Computed 3D by Vconf -m prep SDfile
Find this compound or compounds like it in BindingDB:
Activity Spreadsheet -- Enzyme Inhibition Constant Data from BindingDB
Found 1 hit for monomerid = 50314245
TargetCathepsin S(Homo sapiens (Human))
Johnson & Johnson Pharmaceutical Research & Development
Curated by ChEMBL
LigandPNGBDBM50314245(CHEMBL1090987 | rac-2-(5-(5-ethyl-1-(2-hydroxy-3-(...)
Affinity DataIC50:  250nM. Assay description: Inhibition of human recombinant cathepsin S expressed in baculovirus expression sytem after 15 mins by FRET assay
In DepthDetails ArticlePubMed