BDBM50314253 1-(1-(3-(5-(methylsulfonyl)-3-(3-(2-oxo-2-(piperidin-1-yl)ethylthio)-4-(trifluoromethyl)phenyl)-4,5,6,7-tetrahydro-1H-pyrazolo[4,3-c]pyridin-1-yl)propyl)piperidin-4-yl)pyrrolidin-2-one::CHEMBL1091327
SMILES CS(=O)(=O)N1CCc2c(C1)c(nn2CCCN1CCC(CC1)N1CCCC1=O)-c1ccc(c(SCC(=O)N2CCCCC2)c1)C(F)(F)F
InChI Key InChIKey=HWPGUTYLDOJLNF-UHFFFAOYSA-N
Data  2 IC50
  Tab Delimited (TSV)   2D SDfile   Computed 3D by Vconf -m prep SDfile
Find this compound or compounds like it in BindingDB:
Activity Spreadsheet -- Enzyme Inhibition Constant Data from BindingDB
Found 2 hits for monomerid = 50314253
TargetCathepsin S(Homo sapiens (Human))
Johnson & Johnson Pharmaceutical Research & Development
Curated by ChEMBL
LigandPNGBDBM50314253(1-(1-(3-(5-(methylsulfonyl)-3-(3-(2-oxo-2-(piperid...)
Affinity DataIC50:  70nM. Assay description: Inhibition of human recombinant cathepsin S expressed in baculovirus expression sytem after 15 mins by FRET assay
In DepthDetails ArticlePubMed
TargetCathepsin S(Homo sapiens (Human))
Johnson & Johnson Pharmaceutical Research & Development
Curated by ChEMBL
LigandPNGBDBM50314253(1-(1-(3-(5-(methylsulfonyl)-3-(3-(2-oxo-2-(piperid...)
Affinity DataIC50:  3.92E+3nM. Assay description: Inhibition of cathepsin S in human JY cells assessed as accumulation of invariant chain p10li after 24 hrs by Western blot analysis
In DepthDetails ArticlePubMed