BDBM50314296 1-(4-chlorophenyl)-1-(1-ethylpiperidin-4-yl)-3-(4-fluorobenzyl)urea::CHEMBL1092105
SMILES CCN1CCC(CC1)N(C(=O)NCc1ccc(F)cc1)c1ccc(Cl)cc1
InChI Key InChIKey=AJQVFVAJQHQUGW-UHFFFAOYSA-N
Data  2 KI  2 IC50
  Tab Delimited (TSV)   2D SDfile   Computed 3D by Vconf -m prep SDfile
Find this compound or compounds like it in BindingDB:
Activity Spreadsheet -- Enzyme Inhibition Constant Data from BindingDB
Found 4 hits for monomerid = 50314296
TargetHistamine H3 receptor(Homo sapiens (Human))
Merck Research Laboratories
Curated by ChEMBL
LigandPNGBDBM50314296(1-(4-chlorophenyl)-1-(1-ethylpiperidin-4-yl)-3-(4-...)
Affinity DataKi:  7nM. Assay description: Antagonist activity at human recombinant histamine 3 receptor
In DepthDetails ArticlePubMed
TargetHistamine H3 receptor(Homo sapiens (Human))
Merck Research Laboratories
Curated by ChEMBL
LigandPNGBDBM50314296(1-(4-chlorophenyl)-1-(1-ethylpiperidin-4-yl)-3-(4-...)
Affinity DataKi:  7nM. Assay description: Displacement of [125I]Iodoproxyfan from human recombinant histamine H3 receptor by Competitive binding assay
In DepthDetails ArticlePubMed
TargetPotassium voltage-gated channel subfamily H member 2(Homo sapiens (Human))
Bioprojet-Biotech
Curated by ChEMBL
LigandPNGBDBM50314296(1-(4-chlorophenyl)-1-(1-ethylpiperidin-4-yl)-3-(4-...)
Affinity DataIC50:  6.65E+3nM. Assay description: Displacement of [3H]dofetilide from human recombinant ERG by Competitive binding assay
In DepthDetails ArticlePubMed
TargetPotassium voltage-gated channel subfamily H member 2(Homo sapiens (Human))
Bioprojet-Biotech
Curated by ChEMBL
LigandPNGBDBM50314296(1-(4-chlorophenyl)-1-(1-ethylpiperidin-4-yl)-3-(4-...)
Affinity DataIC50:  6.65E+3nM. Assay description: Inhibition of human ERG by ion works assay
In DepthDetails ArticlePubMed