BDBM50314369 2-((1-ethyl-4-(4-(4-(2-hydroxyethyl)piperazine-1-carbonyl)phenyl)-1H-pyrrolo[2,3-b]pyridin-3-yl)methylene)-4-hydroxybenzofuran-3(2H)-one::CHEMBL1088745
SMILES CCn1cc(\C=C2/Oc3cccc(O)c3C2=O)c2c(ccnc12)-c1ccc(cc1)C(=O)N1CCN(CCO)CC1
InChI Key InChIKey=AQEBVUFYALHXCW-ITYLOYPMSA-N
Data  2 IC50
  Tab Delimited (TSV)   2D SDfile   Computed 3D by Vconf -m prep SDfile
Find this compound or compounds like it in BindingDB:
Activity Spreadsheet -- Enzyme Inhibition Constant Data from BindingDB
Found 2 hits for monomerid = 50314369
TargetSerine/threonine-protein kinase mTOR(Homo sapiens (Human))
Wyeth Research
Curated by ChEMBL
LigandPNGBDBM50314369(2-((1-ethyl-4-(4-(4-(2-hydroxyethyl)piperazine-1-c...)
Affinity DataIC50:  4.60nM. Assay description: Inhibition of mTOR
In DepthDetails ArticlePubMed
LigandPNGBDBM50314369(2-((1-ethyl-4-(4-(4-(2-hydroxyethyl)piperazine-1-c...)
Affinity DataIC50:  455nM. Assay description: Inhibition of PI3Kalpha
In DepthDetails ArticlePubMed