BDBM50314513 5-(2,3-dimethylphenyl)-N-isopropyl-N-(6-methoxypyridin-3-yl)pyrazine-2-carboxamide::CHEMBL1092459
SMILES COc1ccc(cn1)N(C(C)C)C(=O)c1cnc(cn1)-c1cccc(C)c1C
InChI Key InChIKey=OEBYQAZSQJUSMJ-UHFFFAOYSA-N
Data  3 KI
  Tab Delimited (TSV)   2D SDfile   Computed 3D by Vconf -m prep SDfile
Find this compound or compounds like it in BindingDB:
Activity Spreadsheet -- Enzyme Inhibition Constant Data from BindingDB
Found 3 hits for monomerid = 50314513
TargetOxytocin receptor(Homo sapiens (Human))
Pfizer
Curated by ChEMBL
LigandPNGBDBM50314513(5-(2,3-dimethylphenyl)-N-isopropyl-N-(6-methoxypyr...)
Affinity DataKi:  14nM. Assay description: Antagonist activity at human cloned OT receptor by cell based beta-lactamase reporter gene assay
In DepthDetails ArticlePubMed
TargetVasopressin V2 receptor(Homo sapiens (Human))
Pfizer
Curated by ChEMBL
LigandPNGBDBM50314513(5-(2,3-dimethylphenyl)-N-isopropyl-N-(6-methoxypyr...)
Affinity DataKi:  2.30E+3nM. Assay description: Antagonist activity at human cloned vasopressin V2 receptor by cell based beta-lactamase reporter gene assay
In DepthDetails ArticlePubMed
TargetVasopressin V1a receptor(Homo sapiens (Human))
Pfizer
Curated by ChEMBL
LigandPNGBDBM50314513(5-(2,3-dimethylphenyl)-N-isopropyl-N-(6-methoxypyr...)
Affinity DataKi: >1.00E+4nM. Assay description: Antagonist activity at human cloned vasopressin V1A receptor by cell based beta-lactamase reporter gene assay
In DepthDetails ArticlePubMed