BDBM50314700 (R)-2-(2-naphthamido)-5-phenylpent-4-ynoic acid::CHEMBL1090378
SMILES OC(=O)[C@@H](CC#Cc1ccccc1)NC(=O)c1ccc2ccccc2c1
InChI Key InChIKey=IIZVJSCXCNYCFJ-HXUWFJFHSA-N
Data  1 KI  1 IC50
  Tab Delimited (TSV)   2D SDfile   Computed 3D by Vconf -m prep SDfile
Find this compound or compounds like it in BindingDB:
Activity Spreadsheet -- Enzyme Inhibition Constant Data from BindingDB
Found 2 hits for monomerid = 50314700
TargetPeptidyl-prolyl cis-trans isomerase NIMA-interacting 1(Homo sapiens (Human))
Pfizer
Curated by ChEMBL
LigandPNGBDBM50314700((R)-2-(2-naphthamido)-5-phenylpent-4-ynoic acid | ...)
Affinity DataKi:  1.28E+4nM. Assay description: Displacement of WFYpSPFLE from human Pin1 catalytic domain after 10-20 mins by fluorescence polarization assay
In DepthDetails ArticlePubMed
TargetPeptidyl-prolyl cis-trans isomerase NIMA-interacting 1(Homo sapiens (Human))
Pfizer
Curated by ChEMBL
LigandPNGBDBM50314700((R)-2-(2-naphthamido)-5-phenylpent-4-ynoic acid | ...)
Affinity DataIC50: >5.00E+4nM. Assay description: Inhibition of human Pin1 by whole cell assay
In DepthDetails ArticlePubMed