BDBM50314752 CHEMBL1092385::N-[2-({[1-Phenyl-3-(trifluoromethyl)-1H-pyrazol-4-yl]carbonyl}amino)ethyl]-6-(2,2,2-trifluoroethoxy)pyridine-3-carboxamide
SMILES FC(F)(F)COc1ccc(cn1)C(=O)NCCNC(=O)c1cn(nc1C(F)(F)F)-c1ccccc1
InChI Key InChIKey=QQBSDNDBBQAJAF-UHFFFAOYSA-N
Data  2 IC50
  Tab Delimited (TSV)   2D SDfile   Computed 3D by Vconf -m prep SDfile
Find this compound or compounds like it in BindingDB:
Activity Spreadsheet -- Enzyme Inhibition Constant Data from BindingDB
Found 2 hits for monomerid = 50314752
TargetDiacylglycerol O-acyltransferase 1(Mus musculus (mouse))
Takeda Pharmaceutical
Curated by ChEMBL
LigandPNGBDBM50314752(CHEMBL1092385 | N-[2-({[1-Phenyl-3-(trifluoromethy...)
Affinity DataIC50:  44nM. Assay description: Inhibition of DGAT1 in mouse C2C12 cells assessed as suppression of [14C]triglyceride accumulation pretreated for 20 mins before [14C]oleic acid chal...
In DepthDetails ArticlePubMed
TargetDiacylglycerol O-acyltransferase 1(Homo sapiens (Human))
Takeda Pharmaceutical
Curated by ChEMBL
LigandPNGBDBM50314752(CHEMBL1092385 | N-[2-({[1-Phenyl-3-(trifluoromethy...)
Affinity DataIC50:  22nM. Assay description: Inhibition of human DGAT1 expressed in baculovirus infected Sf9 cells using [14C]oleoyl-CoA after 15 mins by TLC analysis
In DepthDetails ArticlePubMed