BDBM50314811 2-((4-(2-(2-(4-chlorophenyl)-5-methyloxazol-4-yl)ethoxy)benzyl)(ptolyloxycarbonyl)amino)acetic acid::CHEMBL1089176
SMILES Cc1oc(nc1CCOc1ccc(CN(CC(O)=O)C(=O)Oc2ccc(C)cc2)cc1)-c1ccc(Cl)cc1
InChI Key InChIKey=QNBMJPHGJSBCGA-UHFFFAOYSA-N
Data  2 IC50  2 EC50
  Tab Delimited (TSV)   2D SDfile   Computed 3D by Vconf -m prep SDfile
Find this compound or compounds like it in BindingDB:
Activity Spreadsheet -- Enzyme Inhibition Constant Data from BindingDB
Found 4 hits for monomerid = 50314811
TargetPeroxisome proliferator-activated receptor alpha(Homo sapiens (Human))
Bristol-Myers Squibb
Curated by ChEMBL
LigandPNGBDBM50314811(2-((4-(2-(2-(4-chlorophenyl)-5-methyloxazol-4-yl)e...)
Affinity DataIC50:  942nM. Assay description: Binding affinity to human His-tagged PPARalpha LBD (E196-Y468) expressed in Escherichia coli BL21 (DE3) by fluorescence polarization assay
In DepthDetails ArticlePubMed
TargetPeroxisome proliferator-activated receptor gamma(Homo sapiens (Human))
Bristol-Myers Squibb
Curated by ChEMBL
LigandPNGBDBM50314811(2-((4-(2-(2-(4-chlorophenyl)-5-methyloxazol-4-yl)e...)
Affinity DataEC50:  75.4nM. Assay description: Agonist activity at human PPARgamma LBD (176-477) expressed in HEK293 cells coexpressing GAL4-DBD by transactivation assay
In DepthDetails ArticlePubMed
TargetPeroxisome proliferator-activated receptor gamma(Homo sapiens (Human))
Bristol-Myers Squibb
Curated by ChEMBL
LigandPNGBDBM50314811(2-((4-(2-(2-(4-chlorophenyl)-5-methyloxazol-4-yl)e...)
Affinity DataIC50:  141nM. Assay description: Binding affinity to human His-tagged PPARgamma LBD (Q203-Y477) expressed in Escherichia coli BL21 (DE3) by fluorescence polarization assay
In DepthDetails ArticlePubMed
TargetPeroxisome proliferator-activated receptor alpha(Homo sapiens (Human))
Bristol-Myers Squibb
Curated by ChEMBL
LigandPNGBDBM50314811(2-((4-(2-(2-(4-chlorophenyl)-5-methyloxazol-4-yl)e...)
Affinity DataEC50:  289nM. Assay description: Agonist activity at human PPARalpha LBD (167-468) expressed in HEK293 cells coexpressing GAL4-DBD by transactivation assay
In DepthDetails ArticlePubMed