BDBM50314821 2-((3-((2-(4-cyanophenyl)-5-methyloxazol-4-yl)methoxy)benzyl)(ptolyloxycarbonyl)amino)acetic acid::CHEMBL1090188
SMILES Cc1oc(nc1COc1cccc(CN(CC(O)=O)C(=O)Oc2ccc(C)cc2)c1)-c1ccc(cc1)C#N
InChI Key InChIKey=LDOTVBJQMMQROS-UHFFFAOYSA-N
Data  4 IC50  2 EC50
  Tab Delimited (TSV)   2D SDfile   Computed 3D by Vconf -m prep SDfile
Find this compound or compounds like it in BindingDB:
Activity Spreadsheet -- Enzyme Inhibition Constant Data from BindingDB
Found 6 hits for monomerid = 50314821
TargetPotassium voltage-gated channel subfamily H member 2(Homo sapiens (Human))
Bristol-Myers Squibb
Curated by ChEMBL
LigandPNGBDBM50314821(2-((3-((2-(4-cyanophenyl)-5-methyloxazol-4-yl)meth...)
Affinity DataIC50:  5.30E+4nM. Assay description: Inhibition of human ERG by electrophysiology assay
In DepthDetails ArticlePubMed
TargetPeroxisome proliferator-activated receptor alpha(Homo sapiens (Human))
Bristol-Myers Squibb
Curated by ChEMBL
LigandPNGBDBM50314821(2-((3-((2-(4-cyanophenyl)-5-methyloxazol-4-yl)meth...)
Affinity DataEC50:  37nM. Assay description: Agonist activity at human PPARalpha LBD (167-468) expressed in HEK293 cells coexpressing GAL4-DBD by transactivation assay
In DepthDetails ArticlePubMed
TargetPeroxisome proliferator-activated receptor gamma(Homo sapiens (Human))
Bristol-Myers Squibb
Curated by ChEMBL
LigandPNGBDBM50314821(2-((3-((2-(4-cyanophenyl)-5-methyloxazol-4-yl)meth...)
Affinity DataEC50:  3.45E+3nM. Assay description: Agonist activity at human PPARgamma LBD (176-477) expressed in HEK293 cells coexpressing GAL4-DBD by transactivation assay
In DepthDetails ArticlePubMed
TargetPeroxisome proliferator-activated receptor gamma(Homo sapiens (Human))
Bristol-Myers Squibb
Curated by ChEMBL
LigandPNGBDBM50314821(2-((3-((2-(4-cyanophenyl)-5-methyloxazol-4-yl)meth...)
Affinity DataIC50:  7.26E+3nM. Assay description: Binding affinity to human His-tagged PPARgamma LBD (Q203-Y477) expressed in Escherichia coli BL21 (DE3) by fluorescence polarization assay
In DepthDetails ArticlePubMed
TargetCytochrome P450 2C9(Homo sapiens (Human))
Bristol-Myers Squibb
Curated by ChEMBL
LigandPNGBDBM50314821(2-((3-((2-(4-cyanophenyl)-5-methyloxazol-4-yl)meth...)
Affinity DataIC50:  2.10E+4nM. Assay description: Inhibition of CYP2C9
In DepthDetails ArticlePubMed
TargetPeroxisome proliferator-activated receptor alpha(Homo sapiens (Human))
Bristol-Myers Squibb
Curated by ChEMBL
LigandPNGBDBM50314821(2-((3-((2-(4-cyanophenyl)-5-methyloxazol-4-yl)meth...)
Affinity DataIC50:  473nM. Assay description: Binding affinity to human His-tagged PPARalpha LBD (E196-Y468) expressed in Escherichia coli BL21 (DE3) by fluorescence polarization assay
In DepthDetails ArticlePubMed