BDBM50314887 1'-(7-ethyl-1H-indazole-5-carbonyl)-5-methoxyspiro[chroman-2,4'-piperidin]-4-one::CHEMBL1092380
SMILES CCc1cc(cc2cn[nH]c12)C(=O)N1CCC2(CC1)CC(=O)c1c(OC)cccc1O2
InChI Key InChIKey=WNWMBBOWDDUFOF-UHFFFAOYSA-N
Data  2 IC50
  Tab Delimited (TSV)   2D SDfile   Computed 3D by Vconf -m prep SDfile
Find this compound or compounds like it in BindingDB:
Activity Spreadsheet -- Enzyme Inhibition Constant Data from BindingDB
Found 2 hits for monomerid = 50314887
TargetAcetyl-CoA carboxylase 2(Homo sapiens (Human))
Pfizer
Curated by ChEMBL
LigandPNGBDBM50314887(1'-(7-ethyl-1H-indazole-5-carbonyl)-5-methoxyspiro...)
Affinity DataIC50:  151nM. Assay description: Inhibition of human recombinant ACC2 expressed in CHO cells after 1 hr by fluorescence reader
In DepthDetails ArticlePubMed
TargetAcetyl-CoA carboxylase 1(Rattus norvegicus (Rat))
Pfizer
Curated by ChEMBL
LigandPNGBDBM50314887(1'-(7-ethyl-1H-indazole-5-carbonyl)-5-methoxyspiro...)
Affinity DataIC50:  102nM. Assay description: Inhibition of rat liver ACC1 after 7 mins by liquid scintillation counter
In DepthDetails ArticlePubMed