BDBM50314974 6-(4-(2-(4-(2,2-dimethylbutyl)-1H-imidazol-2-yl)ethyl)phenyl)pyridin-2-amine::CHEMBL1092381
SMILES CCC(C)(C)Cc1cnc(CCc2ccc(cc2)-c2cccc(N)n2)[nH]1
InChI Key InChIKey=CDWIMKPECRQBRI-UHFFFAOYSA-N
Data  1 IC50  4 EC50
  Tab Delimited (TSV)   2D SDfile   Computed 3D by Vconf -m prep SDfile
Find this compound or compounds like it in BindingDB:
Activity Spreadsheet -- Enzyme Inhibition Constant Data from BindingDB
Found 5 hits for monomerid = 50314974
TargetBombesin receptor subtype-3(Homo sapiens (Human))
Merck Research Laboratories
Curated by ChEMBL
LigandPNGBDBM50314974(6-(4-(2-(4-(2,2-dimethylbutyl)-1H-imidazol-2-yl)et...)
Affinity DataIC50:  7.30nM. Assay description: Displacement of [125I]D-Tyr6-betaAla11-Phe13-Nle14-bombesin from human BRS-3 expressed in NFAT-CHO cells after 2 hrs by scintillation counting
In DepthDetails ArticlePubMed
TargetBombesin receptor subtype-3(Homo sapiens (Human))
Merck Research Laboratories
Curated by ChEMBL
LigandPNGBDBM50314974(6-(4-(2-(4-(2,2-dimethylbutyl)-1H-imidazol-2-yl)et...)
Affinity DataEC50:  37nM. Assay description: Agonist activity at human BRS-3 expressed in HEK293 cells coexpressing AEQ over 10 mins by aequorin bioluminescence assay
In DepthDetails ArticlePubMed
TargetBombesin receptor subtype-3(Mus musculus)
Merck Research Laboratories
Curated by ChEMBL
LigandPNGBDBM50314974(6-(4-(2-(4-(2,2-dimethylbutyl)-1H-imidazol-2-yl)et...)
Affinity DataEC50:  119nM. Assay description: Agonist activity at mouse BRS-3 expressed in HEK293 cells coexpressing AEQ over 10 mins by aequorin bioluminescence assay relative to D-Tyr6-betaAla1...
In DepthDetails ArticlePubMed
TargetBombesin receptor subtype-3(Mus musculus)
Merck Research Laboratories
Curated by ChEMBL
LigandPNGBDBM50314974(6-(4-(2-(4-(2,2-dimethylbutyl)-1H-imidazol-2-yl)et...)
Affinity DataEC50:  3.90nM. Assay description: Agonist activity at mouse BRS-3 expressed in HEK293 cells coexpressing AEQ over 10 mins by aequorin bioluminescence assay
In DepthDetails ArticlePubMed
TargetBombesin receptor subtype-3(Homo sapiens (Human))
Merck Research Laboratories
Curated by ChEMBL
LigandPNGBDBM50314974(6-(4-(2-(4-(2,2-dimethylbutyl)-1H-imidazol-2-yl)et...)
Affinity DataEC50:  97nM. Assay description: Agonist activity at human BRS-3 expressed in HEK293 cells coexpressing AEQ over 10 mins by aequorin bioluminescence assay relative to D-Tyr6-betaAla1...
In DepthDetails ArticlePubMed