BDBM50315081 1-(4-(4-(3-oxa-8-azabicyclo[3.2.1]octan-8-yl)-6-((R)-3-methylmorpholino)-1,3,5-triazin-2-yl)phenyl)-3-(4-(2-(dimethylamino)ethoxy)phenyl)urea::CHEMBL1091715
SMILES C[C@@H]1COCCN1c1nc(nc(n1)-c1ccc(NC(=O)Nc2ccc(OCCN(C)C)cc2)cc1)N1C2CCC1COC2
InChI Key InChIKey=NUUSKGDTQXETAP-ZUOMXFFYSA-N
Data  2 IC50
  Tab Delimited (TSV)   2D SDfile   Computed 3D by Vconf -m prep SDfile
Find this compound or compounds like it in BindingDB:
Activity Spreadsheet -- Enzyme Inhibition Constant Data from BindingDB
Found 2 hits for monomerid = 50315081
TargetSerine/threonine-protein kinase mTOR(Homo sapiens (Human))
Wyeth Research
Curated by ChEMBL
LigandPNGBDBM50315081(1-(4-(4-(3-oxa-8-azabicyclo[3.2.1]octan-8-yl)-6-((...)
Affinity DataIC50:  1.70nM. Assay description: Inhibition of mTOR
In DepthDetails ArticlePubMed
LigandPNGBDBM50315081(1-(4-(4-(3-oxa-8-azabicyclo[3.2.1]octan-8-yl)-6-((...)
Affinity DataIC50:  610nM. Assay description: Inhibition of PI3Kalpha after 15 to 30 mins by fluorescence polarization assay
In DepthDetails ArticlePubMed