BDBM50315137 CHEMBL1088915::isopropyl 4-((6-(4-(dimethylcarbamoyl)piperazin-1-yl)pyridin-3-yloxy)methyl)piperidine-1-carboxylate
SMILES CC(C)OC(=O)N1CCC(COc2ccc(nc2)N2CCN(CC2)C(=O)N(C)C)CC1
InChI Key InChIKey=QUFNQJPLOOKXGX-UHFFFAOYSA-N
Data  1 EC50
  Tab Delimited (TSV)   2D SDfile   Computed 3D by Vconf -m prep SDfile
Find this compound or compounds like it in BindingDB:
Activity Spreadsheet -- Enzyme Inhibition Constant Data from BindingDB
Found 1 hit for monomerid = 50315137
TargetGlucose-dependent insulinotropic receptor(Homo sapiens (Human))
Glaxosmithkline
Curated by ChEMBL
LigandPNGBDBM50315137(CHEMBL1088915 | isopropyl 4-((6-(4-(dimethylcarbam...)
Affinity DataEC50: >1.00E+4nM. Assay description: Agonist activity at human GPR119 receptor expressed in CHO-K1 cells cotransfected with 6CRE-Luc after 5 hrs by luciferase reporter gene assay
In DepthDetails ArticlePubMed