BDBM50315158 2,2-difluoro-1-(4-((6-(4-(propylsulfonyl)piperazin-1-yl)pyridin-3-yloxy)methyl)piperidin-1-yl)ethanone::CHEMBL1093190
SMILES CCCS(=O)(=O)N1CCN(CC1)c1ccc(OCC2CCN(CC2)C(=O)C(F)F)cn1
InChI Key InChIKey=YYUKEXGSOFPCPC-UHFFFAOYSA-N
Data  1 EC50
  Tab Delimited (TSV)   2D SDfile   Computed 3D by Vconf -m prep SDfile
Find this compound or compounds like it in BindingDB:
Activity Spreadsheet -- Enzyme Inhibition Constant Data from BindingDB
Found 1 hit for monomerid = 50315158
TargetGlucose-dependent insulinotropic receptor(Homo sapiens (Human))
Glaxosmithkline
Curated by ChEMBL
LigandPNGBDBM50315158(2,2-difluoro-1-(4-((6-(4-(propylsulfonyl)piperazin...)
Affinity DataEC50:  2.10E+3nM. Assay description: Agonist activity at human GPR119 receptor expressed in CHO-K1 cells cotransfected with 6CRE-Luc after 5 hrs by luciferase reporter gene assay
In DepthDetails ArticlePubMed