BDBM50315233 (4-{8-[4-(1,1-Dioxo-1lambda*6*-thiomorpholin-4-ylmethyl)-phenyl]-quinoxalin-2-yl}-2-methyl-phenyl)-(4-methyl-piperazin-1-yl)-methanone::CHEMBL1092063
SMILES CN1CCN(CC1)C(=O)c1ccc(cc1C)-c1cnc2cccc(-c3ccc(CN4CCS(=O)(=O)CC4)cc3)c2n1
InChI Key InChIKey=BUYQNLCSZXGAEE-UHFFFAOYSA-N
Data  4 IC50
  Tab Delimited (TSV)   2D SDfile   Computed 3D by Vconf -m prep SDfile
Find this compound or compounds like it in BindingDB:
Activity Spreadsheet -- Enzyme Inhibition Constant Data from BindingDB
Found 4 hits for monomerid = 50315233
TargetNon-receptor tyrosine-protein kinase TYK2(Homo sapiens (Human))
Novartis Institutes For Biomedical Research
Curated by ChEMBL
LigandPNGBDBM50315233((4-{8-[4-(1,1-Dioxo-1lambda*6*-thiomorpholin-4-ylm...)
Affinity DataIC50:  330nM. Assay description: Inhibition of recombinant GST tagged TYK2 protein after 60 mins using FITC-Ahx-KKSRGDYMTMQIG-NH2 substrate
In DepthDetails ArticlePubMed
TargetTyrosine-protein kinase JAK3(Homo sapiens (Human))
Novartis Institutes For Biomedical Research
Curated by ChEMBL
LigandPNGBDBM50315233((4-{8-[4-(1,1-Dioxo-1lambda*6*-thiomorpholin-4-ylm...)
Affinity DataIC50:  232nM. Assay description: Inhibition of recombinant GST tagged JAK3 protein after 60 mins using FITC-GGEEEEYFELVKKKK-NH2 substrate
In DepthDetails ArticlePubMed
TargetTyrosine-protein kinase JAK2(Homo sapiens (Human))
Novartis Institutes For Biomedical Research
Curated by ChEMBL
LigandPNGBDBM50315233((4-{8-[4-(1,1-Dioxo-1lambda*6*-thiomorpholin-4-ylm...)
Affinity DataIC50:  7.10nM. Assay description: Inhibition of recombinant GST tagged JAK2 protein after 60 mins using FITC-GGEEEEYFELVKKKK-NH2 substrate
In DepthDetails ArticlePubMed
TargetTyrosine-protein kinase JAK1(Homo sapiens (Human))
Novartis Institutes For Biomedical Research
Curated by ChEMBL
LigandPNGBDBM50315233((4-{8-[4-(1,1-Dioxo-1lambda*6*-thiomorpholin-4-ylm...)
Affinity DataIC50:  89nM. Assay description: Inhibition of recombinant GST tagged JAK1 protein after 60 mins using FITC-Ahx-KKSRGDYMTMQIG-NH2 substrate
In DepthDetails ArticlePubMed