BDBM50315242 1-(1,1-Dioxo-1lambda*6*-thiomorpholin-4-yl)-2-{4-[7-methyl-3-(3,4,5-trimethoxy-phenyl)-quinoxalin-5-yl]-phenyl}-ethanone::CHEMBL1091190
SMILES COc1cc(cc(OC)c1OC)-c1cnc2cc(C)cc(-c3ccc(CC(=O)N4CCS(=O)(=O)CC4)cc3)c2n1
InChI Key InChIKey=QVRUUIVCOVCNGQ-UHFFFAOYSA-N
Data  4 IC50
  Tab Delimited (TSV)   2D SDfile   Computed 3D by Vconf -m prep SDfile
Find this compound or compounds like it in BindingDB:
Activity Spreadsheet -- Enzyme Inhibition Constant Data from BindingDB
Found 4 hits for monomerid = 50315242
TargetTyrosine-protein kinase JAK1(Homo sapiens (Human))
Novartis Institutes For Biomedical Research
Curated by ChEMBL
LigandPNGBDBM50315242(1-(1,1-Dioxo-1lambda*6*-thiomorpholin-4-yl)-2-{4-[...)
Affinity DataIC50: >1.00E+4nM. Assay description: Inhibition of recombinant GST tagged JAK1 protein after 60 mins using FITC-Ahx-KKSRGDYMTMQIG-NH2 substrate
In DepthDetails ArticlePubMed
TargetNon-receptor tyrosine-protein kinase TYK2(Homo sapiens (Human))
Novartis Institutes For Biomedical Research
Curated by ChEMBL
LigandPNGBDBM50315242(1-(1,1-Dioxo-1lambda*6*-thiomorpholin-4-yl)-2-{4-[...)
Affinity DataIC50: >1.00E+4nM. Assay description: Inhibition of recombinant GST tagged TYK2 protein after 60 mins using FITC-Ahx-KKSRGDYMTMQIG-NH2 substrate
In DepthDetails ArticlePubMed
TargetTyrosine-protein kinase JAK3(Homo sapiens (Human))
Novartis Institutes For Biomedical Research
Curated by ChEMBL
LigandPNGBDBM50315242(1-(1,1-Dioxo-1lambda*6*-thiomorpholin-4-yl)-2-{4-[...)
Affinity DataIC50: >1.00E+4nM. Assay description: Inhibition of recombinant GST tagged JAK3 protein after 60 mins using FITC-GGEEEEYFELVKKKK-NH2 substrate
In DepthDetails ArticlePubMed
TargetTyrosine-protein kinase JAK2(Homo sapiens (Human))
Novartis Institutes For Biomedical Research
Curated by ChEMBL
LigandPNGBDBM50315242(1-(1,1-Dioxo-1lambda*6*-thiomorpholin-4-yl)-2-{4-[...)
Affinity DataIC50:  4.20E+3nM. Assay description: Inhibition of recombinant GST tagged JAK2 protein after 60 mins using FITC-GGEEEEYFELVKKKK-NH2 substrate
In DepthDetails ArticlePubMed