BDBM50315326 1-(8-chlorobenzofuro[3,2-d]pyrimidin-4-yl)-N-ethylpyrrolidin-3-amine::CHEMBL1091389
SMILES CCNC1CCN(C1)c1ncnc2c3cc(Cl)ccc3oc12
InChI Key InChIKey=FJGSMAJTUDDGTF-UHFFFAOYSA-N
Data  1 IC50
  Tab Delimited (TSV)   2D SDfile   Computed 3D by Vconf -m prep SDfile
Find this compound or compounds like it in BindingDB:
Activity Spreadsheet -- Enzyme Inhibition Constant Data from BindingDB
Found 1 hit for monomerid = 50315326
TargetHistamine H4 receptor(Homo sapiens (Human))
Argenta Discovery
Curated by ChEMBL
LigandPNGBDBM50315326(1-(8-chlorobenzofuro[3,2-d]pyrimidin-4-yl)-N-ethyl...)
Affinity DataIC50: >1.00E+4nM. Assay description: Displacement of [3H]histamine dihydrochloride from human histamine H4 receptor after 2.5 hrs by scintillation proximity assay
In DepthDetails ArticlePubMed